﻿"Dublin Core:Title","Dublin Core:Subject","Dublin Core:Description","Dublin Core:Creator","Dublin Core:Source","Dublin Core:Publisher","Dublin Core:Date","Dublin Core:Contributor","Dublin Core:Rights","Dublin Core:Relation","Dublin Core:Format","Dublin Core:Language","Dublin Core:Type","Dublin Core:Identifier","Dublin Core:Coverage","Item Type Metadata:Text","Item Type Metadata:Interviewer","Item Type Metadata:Interviewee","Item Type Metadata:Location","Item Type Metadata:Transcription","Item Type Metadata:Local URL","Item Type Metadata:Original Format","Item Type Metadata:Physical Dimensions","Item Type Metadata:Duration","Item Type Metadata:Compression","Item Type Metadata:Producer","Item Type Metadata:Director","Item Type Metadata:Bit Rate/Frequency","Item Type Metadata:Time Summary","Item Type Metadata:Email Body","Item Type Metadata:Subject Line","Item Type Metadata:From","Item Type Metadata:To","Item Type Metadata:CC","Item Type Metadata:BCC","Item Type Metadata:Number of Attachments","Item Type Metadata:Standards","Item Type Metadata:Objectives","Item Type Metadata:Materials","Item Type Metadata:Lesson Plan Text","Item Type Metadata:URL","Item Type Metadata:Event Type","Item Type Metadata:Participants","Item Type Metadata:Birth Date","Item Type Metadata:Birthplace","Item Type Metadata:Death Date","Item Type Metadata:Occupation","Item Type Metadata:Biographical Text","Item Type Metadata:Bibliography",tags,file,itemType,collection,public,featured
"Kings County Leaders","Hill, James A.; Lacey, Horatio G.; Robertson, James Shaw; Slight, George; Valer, Peter Van; Kings County","Left to right: Peter Van Valer, James Shaw Robertson, James A. Hill, Horatio G. Lacey, and George Slight.","L. M. Powell","1 photograph : b&w ; 20.32 x 25.4 cm.","San Joaquin Valley Library System",Feb-07,"Kings County Library","This image was derived from a photograph in the Hanford Carnegie Museum. It can be used for research or educational purposes only. To obtain a digital copy of the original photograph, please contact Kings County Library at 401 N. Douty Street, Hanford, CA 93230, telephone: 559-582-0261.","Hanford Carnegie Museum",image/jpeg,en,Image,kic0022,Feb-07,,,,,,,,,,,,,,,,,,,,,,,,,,,,,,,,,,,"Kings County",http://digital.sjvls.org/files/original/bdacfe5b8d368e15be54b40653949d2a.jpg,"Still Image","Hanford Carnegie Museum",1,0
"Kings County Free Library, Hanford","Libraries; Hanford; Kings County Library; Lacey Boulevard","Exterior of small frame building with library sign.  Building was located on Lacey Boulevard.",,"1 photograph : b + w ; 4 x 6 cm.","San Joaquin Valley Library System",1950,"Kings County Library","This image was derived from a photograph in the Hanford Carnegie Museum. It can be used for research or educational purposes only. To obtain a digital copy of the original photograph, please contact Kings County Library at 401 N. Douty Street, Hanford, CA 93230, telephone: 559-582-0261.","Hanford Carnegie Museum",image/jpeg,en,Image,kic0001,1950,,,,,,,,,,,,,,,,,,,,,,,,,,,,,,,,,,,"Hanford, CA,Kings County Library,Lacey Boulevard,Libraries",http://digital.sjvls.org/files/original/c0be7e7db085af3e69c3326ae5832f00.jpg,"Still Image","Hanford Carnegie Museum",1,0
"Members of the Ancient Order of United Workmen","Ancient Order of United Workmen; AOUW; Fraternal Organizations; Lodges; Hanford","Group of men, most of them wearing uniforms.",,"1 photograph : b&w ; 27.305 x 31.75 cm.","San Joaquin Valley Library System",[1898],"Kings County Library","This image was derived from a photograph in the Hanford Carnegie Museum. It can be used for research or educational purposes only. To obtain a digital copy of the original photograph, please contact Kings County Library at 401 N. Douty Street, Hanford, CA 93230, telephone: 559-582-0261.","Hanford Carnegie Museum",image/jpeg,en,Image,kic0002,[1898],,,,,,,,,,,,,,,,,,,,,,,,,,,,,,,,,,,"CA,Fraternal Organizations,Hanford,Hanford, CA,Lodges",http://digital.sjvls.org/files/original/2c7890d8e09b7e0726eeb161c65ec283.jpg,"Still Image","Hanford Carnegie Museum",1,0
"Marve Corey's Oil Well in Coalinga","Corey, Marve; Derricks; Oil wells; Petroleum; Coalinga","Three men on ground near oil well buildings and man on top of derrick. Hills in background.",,"1 photograph : b&w ; 24.765 x 26.670 cm.","San Joaquin Valley Library System",,"Kings County Library","This image was derived from a photograph in the Hanford Carnegie Museum. It can be used for research or educational purposes only. To obtain a digital copy of the original photograph, please contact Kings County Library at 401 N. Douty Street, Hanford, CA 93230, telephone: 559-582-0261.","Hanford Carnegie Museum",image/jpeg,en,Image,kic0003,,,,,,,,,,,,,,,,,,,,,,,,,,,,,,,,,,,,"Coalinga,Derricks,Oil wells",http://digital.sjvls.org/files/original/41906747dea0d5e057776e244b47fa6a.jpg,"Still Image","Hanford Carnegie Museum",1,0
"Coalinga Oil Fields","Derricks; Oil wells; Petroleum; Coalinga","Oil wells with hills in background. One of the wells is gushing.",,"1 photograph : b&w ; 20.320 x 25.4 cm.","San Joaquin Valley Library System",,"Kings County Library","This image was derived from a photograph in the Hanford Carnegie Museum. It can be used for research or educational purposes only. To obtain a digital copy of the original photograph, please contact Kings County Library at 401 N. Douty Street, Hanford, CA 93230, telephone: 559-582-0261.","Hanford Carnegie Museum",image/jpeg,en,Image,kic0004,,,,,,,,,,,,,,,,,,,,,,,,,,,,,,,,,,,,"Coalinga,Derricks,Oil wells",http://digital.sjvls.org/files/original/296b6695c173390c96a9a1f79185299b.jpg,"Still Image","Hanford Carnegie Museum",1,0
"Hanford Opera House","Drug Stores; Pharmacies; Hanford; Irwin Street; Keller's Pharmacy; Opera House; Seventh Street","Original three-story brick Opera House with Keller's Pharmacy on corner of Seventh and Irwin Streets.",,"1 photograph : b&w ; 19.05 x 19.05 cm.","San Joaquin Valley Library System",[1893],"Kings County Library","This image was derived from a photograph in the Hanford Carnegie Museum. It can be used for research or educational purposes only. To obtain a digital copy of the original photograph, please contact Kings County Library at 401 N. Douty Street, Hanford, CA 93230, telephone: 559-582-0261.","Hanford Carnegie Museum",image/jpeg,en,Image,kic0005,[1893],,,,,,,,,,,,,,,,,,,,,,,,,,,,,,,,,,,"Drug Stores,Hanford, CA,Irwin Street,Keller's Pharmacy,Opera House,Pharmacies,Seventh Street",http://digital.sjvls.org/files/original/20329ca594cf08505a8ea668a9f06f17.jpg,"Still Image","Hanford Carnegie Museum",1,0
"Lobby of Artesia Hotel","African-Americans; Fountains; Hotels; Artesia Hotel; Hanford; Irwin Street; Sixth Street","Lobby of Artesia Hotel located on the corner of Irwin and Sixth Streets in Hanford. Men seated around fountain and standing on stairs and at desk. African-American employees on balcony. Specter of man at top of stairs.",,"1 photograph : b&w ; 26.670 x 31.115 cm.","San Joaquin Valley Library System",[1899],"Kings County Library","This image was derived from a photograph in the Hanford Carnegie Museum. It can be used for research or educational purposes only. To obtain a digital copy of the original photograph, please contact Kings County Library at 401 N. Douty Street, Hanford, CA 93230, telephone: 559-582-0261.","Hanford Carnegie Museum",image/jpeg,en,Image,kic0006,[1899],,,,,,,,,,,,,,,,,,,,,,,,,,,,,,,,,,,"African-Americans,CA,Fountains,Hanford,Hanford, CA,Hotels,Irwin Street,Sixth Street",http://digital.sjvls.org/files/original/67055e7f48df9bfa2cde76cc4cbd8eb7.jpg,"Still Image","Hanford Carnegie Museum",1,0
"Men and Decorated Wagon in Front of Artesia Hotel","Lacey, Horatio; Horses; Hotels; Wagons; Artesia Hotel; Hanford; Irwin Street","Men in long coats and top hats standing by flag-decked wagon in front of Artesia Hotel on Irwin Street in Hanford. Horatio Lacey, owner of Lacey Milling, is second from left.",,"1 photograph : b&w ; 27.305 x 31.115 cm.","San Joaquin Valley Library System",[1905],"Kings County Library","This image was derived from a photograph in the Hanford Carnegie Museum. It can be used for research or educational purposes only. To obtain a digital copy of the original photograph, please contact Kings County Library at 401 N. Douty Street, Hanford, CA 93230, telephone: 559-582-0261.","Hanford Carnegie Museum",image/jpeg,en,Image,kic0007,[1905],,,,,,,,,,,,,,,,,,,,,,,,,,,,,,,,,,,"Hanford, CA,Horses,Hotels,Irwin Street,Wagons",http://digital.sjvls.org/files/original/ac0068d250c89112725d4ba0fe825249.jpg,"Still Image","Hanford Carnegie Museum",1,0
"Construction of 4th Story on Hanford Opera House","Kutner, Goldstein, and Company; Automobiles; Construction; Department Stores; Horses; Hotels; Wagons; Artesia Hotel; Hanford; Irwin Street; Opera House; Seventh Street","Scaffolding on side of 3-story masonry building as 4th floor is being added to Hanford Opera House. This wooden 4th-story burned in 1928 fire. Kutner-Goldstein department store on left and Artesia Hotel on right. Construction workers and equipment as well as horse-drawn vehicles and automobiles on street.",,"1 photograph : b&w ; 11.43 x 15.24 cm.","San Joaquin Valley Library System",1914,"Kings County Library","This image was derived from a photograph in the Hanford Carnegie Museum. It can be used for research or educational purposes only. To obtain a digital copy of the original photograph, please contact Kings County Library at 401 N. Douty Street, Hanford, CA 93230, telephone: 559-582-0261.","Hanford Carnegie Museum",image/jpeg,en,Image,kic0008,1914,,,,,,,,,,,,,,,,,,,,,,,,,,,,,,,,,,,"Automobiles,Construction,Department Stores,Hanford, CA,Horses,Hotels,Irwin Street,Kutner, Goldstein, and Company,Opera House,Seventh Street,Wagons",http://digital.sjvls.org/files/original/9d764f62ad5fe5b2a39b326c21dbc8c3.jpg,"Still Image","Hanford Carnegie Museum",1,0
"Lacey Milling Company","Lacey Milling Company; Flour Mills; Mills; Fifth Street; Hanford","Exterior of Lacey Milling, brick mill building with sacks against walls. Built in 1916 to replace original wooden building that burned.",,"1 photograph : b&w ; 20.32 x 25.4 cm.","San Joaquin Valley Library System",[1916],"Kings County Library","This image was derived from a photograph in the Hanford Carnegie Museum. It can be used for research or educational purposes only. To obtain a digital copy of the original photograph, please contact Kings County Library at 401 N. Douty Street, Hanford, CA 93230, telephone: 559-582-0261.","Hanford Carnegie Museum",image/jpeg,en,Image,kic0009,[1916],,,,,,,,,,,,,,,,,,,,,,,,,,,,,,,,,,,"Fifth Street,Flour Mills,Hanford, CA,Lacey Milling Company,Mills",http://digital.sjvls.org/files/original/8e946b390f7fd4c2bb80a7fc503831a9.jpg,"Still Image","Hanford Carnegie Museum",1,0
