﻿"Dublin Core:Title","Dublin Core:Subject","Dublin Core:Description","Dublin Core:Creator","Dublin Core:Source","Dublin Core:Publisher","Dublin Core:Date","Dublin Core:Contributor","Dublin Core:Rights","Dublin Core:Relation","Dublin Core:Format","Dublin Core:Language","Dublin Core:Type","Dublin Core:Identifier","Dublin Core:Coverage","Item Type Metadata:Text","Item Type Metadata:Interviewer","Item Type Metadata:Interviewee","Item Type Metadata:Location","Item Type Metadata:Transcription","Item Type Metadata:Local URL","Item Type Metadata:Original Format","Item Type Metadata:Physical Dimensions","Item Type Metadata:Duration","Item Type Metadata:Compression","Item Type Metadata:Producer","Item Type Metadata:Director","Item Type Metadata:Bit Rate/Frequency","Item Type Metadata:Time Summary","Item Type Metadata:Email Body","Item Type Metadata:Subject Line","Item Type Metadata:From","Item Type Metadata:To","Item Type Metadata:CC","Item Type Metadata:BCC","Item Type Metadata:Number of Attachments","Item Type Metadata:Standards","Item Type Metadata:Objectives","Item Type Metadata:Materials","Item Type Metadata:Lesson Plan Text","Item Type Metadata:URL","Item Type Metadata:Event Type","Item Type Metadata:Participants","Item Type Metadata:Birth Date","Item Type Metadata:Birthplace","Item Type Metadata:Death Date","Item Type Metadata:Occupation","Item Type Metadata:Biographical Text","Item Type Metadata:Bibliography",tags,file,itemType,collection,public,featured
"Abe family","Abe, Lily; Abe, Mary Akiko; Abe, Mollie  Fukuko; Abe, Franklin Kazuichi.; Abe, Kenji.; Abe, Shigeko.; Masako, Alice.; Nagata, Lily Abe.; Osato, Mollie Abe.; Sakaguchi, Mary Akiko Abe.","Abe family is pictured (left to right): Lily Abe Nagata, Franklin Kazuichi Abe; Mary Akiko Abe Sakaguchi, Kenji Abe, Shigeko Abe, Alice Masako, and Mollie Abe Osato.",,,"San Joaquin Valley Library System",,"Tulare County Library","This image is being made available for educational and research purposes only, under the ?fair use? clause of the U.S. Copyright Law (Title 17 ? 107 U.S.C.) Further questions regarding the image or its use may be directed to the Tulare County Library, 200 W. Oak Ave., Visalia, CA 93291; Phn: 559-733-6954; Fax: 559-737-4586.","Shades of Tulare County (Tulare County Library)",image/jpeg,en,Image,tcb0103,,,,,,,,,,,,,,,,,,,,,,,,,,,,,,,,,,,,Nagata,http://digital.sjvls.org/files/original/96fb8831f94fc38609194f7954762472.jpg,"Still Image","Shades of Tulare County Project",1,0
"Abe family photo","Abe Mollie Fukuko; Abe, Alice; Abe, Mary Akiko; Abe, Franklin Kazuichi.; Kurihara, Alice Abe.; Nagata, Lily Aloe.; Osato, Mollie Abe.; Sakaguchi, Mary Aloe.","Members of the Abe family pictured are (left to right): Mary Aloe Sakaguchi, Mollie Fukuko Abe Osato, Franklin Kazuichi Abe, Lily Aloe Nagata, and Alice Abe Kurihara.",,,"San Joaquin Valley Library System",ca1930s,"Tulare County Library","This image is being made available for educational and research purposes only, under the ?fair use? clause of the U.S. Copyright Law (Title 17 ? 107 U.S.C.) Further questions regarding the image or its use may be directed to the Tulare County Library, 200 W. Oak Ave., Visalia, CA 93291; Phn: 559-733-6954; Fax: 559-737-4586.","Shades of Tulare County (Tulare County Library)",image/jpeg,en,Image,tcb0101,ca1930s,,,,,,,,,,,,,,,,,,,,,,,,,,,,,,,,,,,"Fukuko,Kurihara,Nagata",http://digital.sjvls.org/files/original/82b46c3d78f7e2b0ba358480c65cc666.jpg,"Still Image","Shades of Tulare County Project",1,0
"Adobe bricks drying at Camp Poston","Japanese Americans -- Evacuation and relocation, 1942-1945.; Poston Relocation Camp (Parker, Ariz.)","Adobe bricks drying in the sun at Camp Poston.",,,"San Joaquin Valley Library System",1944-1945,"Tulare County Library","This image is being made available for educational and research purposes only, under the ?fair use? clause of the U.S. Copyright Law (Title 17 ? 107 U.S.C.) Further questions regarding the image or its use may be directed to the Tulare County Library, 200 W. Oak Ave., Visalia, CA 93291; Phn: 559-733-6954; Fax: 559-737-4586.","Shades of Tulare County (Tulare County Library)",image/jpeg,en,Image,tcb0266,1944-1945,,,,,,,,,,,,,,,,,,,,,,,,,,,,,,,,,,,"Arizona,Internment camps,Japanese Americans,Japanese Americans -- Evacuation and relocation,Japanese Americans -- Evacuation and relocation, 1942-1945.,Poston Relocation Camp,Poston Relocation Camp (Parker,Poston Relocation Camp (Parker, Ariz.)",http://digital.sjvls.org/files/original/38840e4a552703ecfe4a06a9c3ce566e.jpg,"Still Image","Shades of Tulare County Project",1,0
"Aiko Fukushima and baseball team","Fukushima, Aiko.; Japanese Americans -- Evacuation and relocation, 1942-1945","Baseball team at Arizona internment camp. Aiko Fukushima is pictured at the far right in the first row.",,,"San Joaquin Valley Library System",1942-1945,"Tulare County Library","This image is being made available for educational and research purposes only, under the ?fair use? clause of the U.S. Copyright Law (Title 17 ? 107 U.S.C.) Further questions regarding the image or its use may be directed to the Tulare County Library, 200 W. Oak Ave., Visalia, CA 93291; Phn: 559-733-6954; Fax: 559-737-4586.","Shades of Tulare County (Tulare County Library)",image/jpeg,en,Image,tcb0329,1942-1945,,,,,,,,,,,,,,,,,,,,,,,,,,,,,,,,,,,"Baseball,Fukushima,Internment camps,Japanese Americans -- Evacuation and relocation,Japanese Americans -- Evacuation and relocation, 1942-1945",http://digital.sjvls.org/files/original/349132cf431409753db378c6107954ac.jpg,"Still Image","Shades of Tulare County Project",1,0
"Aiko Yamashita dressed as a cheerleader","Yamashita, Aiko.","Aiko Yamashita was a cheerleader at Visalia Senior High School during the 1952-53 school year.",,,"San Joaquin Valley Library System",1952-53,"Tulare County Library","This image is being made available for educational and research purposes only, under the ?fair use? clause of the U.S. Copyright Law (Title 17 ? 107 U.S.C.) Further questions regarding the image or its use may be directed to the Tulare County Library, 200 W. Oak Ave., Visalia, CA 93291; Phn: 559-733-6954; Fax: 559-737-4586.","Shades of Tulare County (Tulare County Library)",image/jpeg,en,Image,tcb0195,1952-53,,,,,,,,,,,,,,,,,,,,,,,,,,,,,,,,,,,,http://digital.sjvls.org/files/original/fefc499aa09add1a33a139bb5ead4e69.jpg,"Still Image","Shades of Tulare County Project",1,0
"Aki Imoto","Imoto, Aki.","Aki Imoto in 1939.",,,"San Joaquin Valley Library System",1939,"Tulare County Library","This image is being made available for educational and research purposes only, under the ?fair use? clause of the U.S. Copyright Law (Title 17 ? 107 U.S.C.) Further questions regarding the image or its use may be directed to the Tulare County Library, 200 W. Oak Ave., Visalia, CA 93291; Phn: 559-733-6954; Fax: 559-737-4586.","Shades of Tulare County (Tulare County Library)",image/jpeg,en,Image,tcb0130,1939,,,,,,,,,,,,,,,,,,,,,,,,,,,,,,,,,,,,http://digital.sjvls.org/files/original/2896094096cf1928b690e29f7092508f.jpg,"Still Image","Shades of Tulare County Project",1,0
"Alice, Mike and Roy Suyeda","Suyeda, Alice.; Suyeda, Mike.; Suyeda, Roy.","Alice Suyeda (left), her brother Mike (center) and cousin Roy spend an everning reading magazines. The photo was taken in 1948.",,,"San Joaquin Valley Library System",1948,"Tulare County Library","This image is being made available for educational and research purposes only, under the ?fair use? clause of the U.S. Copyright Law (Title 17 ? 107 U.S.C.) Further questions regarding the image or its use may be directed to the Tulare County Library, 200 W. Oak Ave., Visalia, CA 93291; Phn: 559-733-6954; Fax: 559-737-4586.","Shades of Tulare County (Tulare County Library)",image/jpeg,en,Image,tcb0467,1948,,,,,,,,,,,,,,,,,,,,,,,,,,,,,,,,,,,,http://digital.sjvls.org/files/original/b8029224ba651147db7e5ac3c27b2e78.jpg,"Still Image","Shades of Tulare County Project",1,0
"Atsuko Shimasaki","Shimasaki, Atsuko.","Atsuko Shimasaki (here in her graduation photo) graduated from the University of Missouri in 1944. She was elected to Phi Beta Kappa.",,,"San Joaquin Valley Library System",1944,"Tulare County Library","This image is being made available for educational and research purposes only, under the ?fair use? clause of the U.S. Copyright Law (Title 17 ? 107 U.S.C.) Further questions regarding the image or its use may be directed to the Tulare County Library, 200 W. Oak Ave., Visalia, CA 93291; Phn: 559-733-6954; Fax: 559-737-4586.","Shades of Tulare County (Tulare County Library)",image/jpeg,en,Image,tcb0153,1944,,,,,,,,,,,,,,,,,,,,,,,,,,,,,,,,,,,,http://digital.sjvls.org/files/original/35d8dfb280df8f173abfed9ded8ff633.jpg,"Still Image","Shades of Tulare County Project",1,0
"Atsuko Shimasaki photo and Valedictorian certificate","Shimasaki, Atsuko.","Atsuko Shimasaki was named Strathmore High School Valedictorian for her graduating class in 1940. Both her graduation photo and the certificate ae pictured here. She went on to graduate from the University of Missouri.",,,"San Joaquin Valley Library System",1940,"Tulare County Library","This image is being made available for educational and research purposes only, under the ?fair use? clause of the U.S. Copyright Law (Title 17 ? 107 U.S.C.) Further questions regarding the image or its use may be directed to the Tulare County Library, 200 W. Oak Ave., Visalia, CA 93291; Phn: 559-733-6954; Fax: 559-737-4586.","Shades of Tulare County (Tulare County Library)",image/jpeg,en,Image,tcb0152,1940,,,,,,,,,,,,,,,,,,,,,,,,,,,,,,,,,,,,http://digital.sjvls.org/files/original/7e9a772f4c095e0c2531b34113d71370.jpg,"Still Image","Shades of Tulare County Project",1,0
"Atsuko, Sam and Rinko Shimasaki in Chicago","Shimasaki, Atsuko.; Shimasaki, Rinko.; Shimasaki, Sam.","Atsuko (left), Sam and Rinko Shimasaki are pictured in Chicago in April 1945. Sam was on furlough.",,,"San Joaquin Valley Library System",Apr-45,"Tulare County Library","This image is being made available for educational and research purposes only, under the ?fair use? clause of the U.S. Copyright Law (Title 17 ? 107 U.S.C.) Further questions regarding the image or its use may be directed to the Tulare County Library, 200 W. Oak Ave., Visalia, CA 93291; Phn: 559-733-6954; Fax: 559-737-4586.","Shades of Tulare County (Tulare County Library)",image/jpeg,en,Image,tcb0163,Apr-45,,,,,,,,,,,,,,,,,,,,,,,,,,,,,,,,,,,,http://digital.sjvls.org/files/original/1e7de36631ca919397303cb7a4a614a9.jpg,"Still Image","Shades of Tulare County Project",1,0
