﻿"Dublin Core:Title","Dublin Core:Subject","Dublin Core:Description","Dublin Core:Creator","Dublin Core:Source","Dublin Core:Publisher","Dublin Core:Date","Dublin Core:Contributor","Dublin Core:Rights","Dublin Core:Relation","Dublin Core:Format","Dublin Core:Language","Dublin Core:Type","Dublin Core:Identifier","Dublin Core:Coverage","Item Type Metadata:Text","Item Type Metadata:Interviewer","Item Type Metadata:Interviewee","Item Type Metadata:Location","Item Type Metadata:Transcription","Item Type Metadata:Local URL","Item Type Metadata:Original Format","Item Type Metadata:Physical Dimensions","Item Type Metadata:Duration","Item Type Metadata:Compression","Item Type Metadata:Producer","Item Type Metadata:Director","Item Type Metadata:Bit Rate/Frequency","Item Type Metadata:Time Summary","Item Type Metadata:Email Body","Item Type Metadata:Subject Line","Item Type Metadata:From","Item Type Metadata:To","Item Type Metadata:CC","Item Type Metadata:BCC","Item Type Metadata:Number of Attachments","Item Type Metadata:Standards","Item Type Metadata:Objectives","Item Type Metadata:Materials","Item Type Metadata:Lesson Plan Text","Item Type Metadata:URL","Item Type Metadata:Event Type","Item Type Metadata:Participants","Item Type Metadata:Birth Date","Item Type Metadata:Birthplace","Item Type Metadata:Death Date","Item Type Metadata:Occupation","Item Type Metadata:Biographical Text","Item Type Metadata:Bibliography",tags,file,itemType,collection,public,featured
"Whitney Biggar","Biggar, Whitney; Kern County Library; Bakersfield; Truxtun Avenue","Whitney Biggar, Architect, Kern County Library Headquarters, 1315 Truxtun Ave.",,"1 photograph : b&w ; 19.9 x 11.8 cm.","San Joaquin Valley Library System",1957,"Kern County Library",,"Kern County Library",image/jpeg,en,Image,kel0075,1957,,,,,,,,,,,,,,,,,,,,,,,,,,,,,,,,,,,"Bakersfield,Kern County Library,Libraries,People,Truxtun Avenue,Whitney",http://digital.sjvls.org/files/original/d15450784259d5559bbf4db3d1c87713.jpg,"Still Image","Kern County Library Collection",1,0
"Western Parade at Chester Avenue","Bakersfield (Calif.)--Downtown; Costumes; Florist shops; Parades & processions","Parade in downtown Bakersfield, showing participants in costumes from 19th-century Old West",Unknown,"1 photographic print; 8.5 x 13 cm.","San Joaquin Valley Library System","circa 1940","Kern County Library","This image is being made available for educational and research purposes only, under the ""fair use"" clause of the U.S. Copyright Law (Title 17 ? 107 U.S.C.) Further questions regarding the image or its use may be directed to the Beale Memorial Library, Local History Room, 701 Truxtun Ave., Bakersfield, CA 93301; phone 661-868-0776.","Kern County Library",image/jpeg,en-US,Image,kec0235,"circa 1940",,,,,,,,,,,,,,,,,,,,,,,,,,,,,,,,,,,"Bakersfield,Costumes,Florist shops,Parades,Parades & processions",http://digital.sjvls.org/files/original/ef2439460beec02f0806bfae42bdcf3b.jpg,"Still Image","Kern County Local History Photograph Collection",1,0
"West on 20th Street from Chester Avenue","Bakersfield (Calif.)--Downtown; Buildings; Fox Theater (Bakersfield, Calif.); Streets; Theaters","View of downtown Bakersfield; from the collection of Harlan Curnow",Unknown,"1 photographic print; 8.5 x 13 cm.","San Joaquin Valley Library System",1931,"Kern County Library","This image is being made available for educational and research purposes only, under the ""fair use"" clause of the U.S. Copyright Law (Title 17 ? 107 U.S.C.) Further questions regarding the image or its use may be directed to the Beale Memorial Library, Local History Room, 701 Truxtun Ave., Bakersfield, CA 93301; phone 661-868-0776.","Kern County Library",image/jpeg,en-US,Image,kec0234,1931,,,,,,,,,,,,,,,,,,,,,,,,,,,,,,,,,,,"Bakersfield,Buildings,Fox Theater (Bakersfield,Fox Theater (Bakersfield, Calif.),Streets,Theaters",http://digital.sjvls.org/files/original/29a5ae47d1097209b56d07dafc988d70.jpg,"Still Image","Kern County Local History Photograph Collection",1,0
"West on 19th Street from K Street","Bakersfield (Calif.)--Downtown; Clothing & dress; Stores & shops","Shows street of downtown Bakersfield, with pedestrians and various shops; from the collection of Harlan Curnow",Unknown,"1 photographic print; 8.5 x 13 cm.","San Joaquin Valley Library System",1930s,"Kern County Library","This image is being made available for educational and research purposes only, under the ""fair use"" clause of the U.S. Copyright Law (Title 17 ? 107 U.S.C.) Further questions regarding the image or its use may be directed to the Beale Memorial Library, Local History Room, 701 Truxtun Ave., Bakersfield, CA 93301; phone 661-868-0776.","Kern County Library",image/jpeg,en-US,Image,kec0233,1930s,,,,,,,,,,,,,,,,,,,,,,,,,,,,,,,,,,,"Bakersfield,Clothing & dress,Stores & shops",http://digital.sjvls.org/files/original/ae4c65f8c521b4a9ee60852e46734254.jpg,"Still Image","Kern County Local History Photograph Collection",1,0
"West on 19th Street at K Street","Automobiles; Bakersfield (Calif.)--Downtown; Buildings; Vehicles","View of downtown Bakersfield; from the collection of Harlan Curnow",Unknown,"1 photographic print; 8.5 x 13 cm.","San Joaquin Valley Library System",1930s,"Kern County Library","This image is being made available for educational and research purposes only, under the ""fair use"" clause of the U.S. Copyright Law (Title 17 ? 107 U.S.C.) Further questions regarding the image or its use may be directed to the Beale Memorial Library, Local History Room, 701 Truxtun Ave., Bakersfield, CA 93301; phone 661-868-0776.","Kern County Library",image/jpeg,en-US,Image,kec0232,1930s,,,,,,,,,,,,,,,,,,,,,,,,,,,,,,,,,,,"Automobiles,Bakersfield,Buildings,vehicles",http://digital.sjvls.org/files/original/8cb10119d8125d525c8665eda6558f90.jpg,"Still Image","Kern County Local History Photograph Collection",1,0
"Wagon decorated for a holiday parade","Bakersfield (Calif.) -- Photographs.","A wagon filled with people and decorated with flowers for a holiday parade.","Watkins, Carleton E., 1829-1916.","1 photograph : b&w, 8 x 10 in.","San Joaquin Valley Library System",[1886-1906],"Kern County Library","This image is being made available for educational and research purposes only, under the ?fair use? clause of the U.S. Copyright Law (Title 17 ? 107 U.S.C.) Further questions regarding the image or its use may be directed to the Beale Memorial Library, Local History Room, 701 Truxtun Ave., Bakersfield, CA 93301; phone 661-868-0776.",,image/jpeg,en,Image,kew0025,[1886-1906],,,,,,,,,,,,,,,,,,,,,,,,,,,,,,,,,,,"Bakersfield,Parades",http://digital.sjvls.org/files/original/341a23b2325a0360e300099b69d11def.jpg,"Still Image","Carleton Watkins Collection",1,0
"View of holiday parade","Bakersfield (Calif.) -- Photographs","Bakersfield fire wagon filled with children for the holiday parade.","Watkins, Carleton E., 1829-1916.","1 photograph : b&w, 8 x 10 in.","San Joaquin Valley Library System",[1896-1906],"Kern County Library","This image is being made available for educational and research purposes only, under the ?fair use? clause of the U.S. Copyright Law (Title 17 ? 107 U.S.C.) Further questions regarding the image or its use may be directed to the Beale Memorial Library, Local History Room, 701 Truxtun Ave., Bakersfield, CA 93301; phone 661-868-0776.",,image/jpeg,en,Image,kew0023,[1896-1906],,,,,,,,,,,,,,,,,,,,,,,,,,,,,,,,,,,"Bakersfield,Parades",http://digital.sjvls.org/files/original/6f2954861f34f8f012d77084d121c2dc.jpg,"Still Image","Carleton Watkins Collection",1,0
"The Bakersfield Californian","Bakersfield Californian; Kern County (Calif.)-- Photographs; Bakersfield","The Bakersfield Californian building","Walker, Kathleen","1 photograph : color ; 10.1 x 15.2 cm.","San Joaquin Valley Library System",Feb-94,"Kern County Library","This image is being made available for educational and research purposes only, under the ?fair use? clause of the U.S. Copyright Law (Title 17 ? 107 U.S.C.) Further questions regarding the image or its use may be directed to the Beale Memorial Library, Local History Room, 701 Truxtun Ave., Bakersfield, CA 93301; phone 661-868-0776.","Kern County Library",image/jpeg,en,Image,kek0009,Feb-94,,,,,,,,,,,,,,,,,,,,,,,,,,,,,,,,,,,"Bakersfield,CA,Kern County,Newspapers",http://digital.sjvls.org/files/original/2dd026b786a91a9fc8c01e3a0e3c7686.jpg,"Still Image","Kathleen Walker Collection",1,0
"Tejon Theater","Kern County (Calif.)-- Photographs; Theaters; Baker Street; Bakersfield; Monterey Street; Tejon Theater","The Tejon Theater at Baker St. and Monterey St., Bakersfield.","Walker, Kathleen","1 photograph : color ; 10.1 x 15.2 cm.","San Joaquin Valley Library System",May-94,"Kern County Library","This image is being made available for educational and research purposes only, under the ?fair use? clause of the U.S. Copyright Law (Title 17 ? 107 U.S.C.) Further questions regarding the image or its use may be directed to the Beale Memorial Library, Local History Room, 701 Truxtun Ave., Bakersfield, CA 93301; phone 661-868-0776.","Kern County Library",image/jpeg,en,Image,kek0045,May-94,,,,,,,,,,,,,,,,,,,,,,,,,,,,,,,,,,,"Bakersfield,CA,Kern County,Monterey Street,Tejon Theater,Theaters",http://digital.sjvls.org/files/original/443cfed5e868862a4d58f0b91c3535ba.jpg,"Still Image","Kathleen Walker Collection",1,0
"Steam pumper in holiday parade","Bakersfield (Calif.) -- Photographs.","Aerial view of Bakersfield's steam ""pumper"" decorated and participating in a holiday parade.","Watkins, Carleton E., 1829-1916.","1 photograph : b&w, 8 x 10 in.","San Joaquin Valley Library System",[1896-1906],"Kern County Library","This image is being made available for educational and research purposes only, under the ?fair use? clause of the U.S. Copyright Law (Title 17 ? 107 U.S.C.) Further questions regarding the image or its use may be directed to the Beale Memorial Library, Local History Room, 701 Truxtun Ave., Bakersfield, CA 93301; phone 661-868-0776.",,image/jpeg,en,Image,kew0024,[1896-1906],,,,,,,,,,,,,,,,,,,,,,,,,,,,,,,,,,,"Bakersfield,Parades",http://digital.sjvls.org/files/original/bb157bf258d7a8339338985cbe4902e0.jpg,"Still Image","Carleton Watkins Collection",1,0
