﻿"Dublin Core:Title","Dublin Core:Subject","Dublin Core:Description","Dublin Core:Creator","Dublin Core:Source","Dublin Core:Publisher","Dublin Core:Date","Dublin Core:Contributor","Dublin Core:Rights","Dublin Core:Relation","Dublin Core:Format","Dublin Core:Language","Dublin Core:Type","Dublin Core:Identifier","Dublin Core:Coverage","Item Type Metadata:Text","Item Type Metadata:Interviewer","Item Type Metadata:Interviewee","Item Type Metadata:Location","Item Type Metadata:Transcription","Item Type Metadata:Local URL","Item Type Metadata:Original Format","Item Type Metadata:Physical Dimensions","Item Type Metadata:Duration","Item Type Metadata:Compression","Item Type Metadata:Producer","Item Type Metadata:Director","Item Type Metadata:Bit Rate/Frequency","Item Type Metadata:Time Summary","Item Type Metadata:Email Body","Item Type Metadata:Subject Line","Item Type Metadata:From","Item Type Metadata:To","Item Type Metadata:CC","Item Type Metadata:BCC","Item Type Metadata:Number of Attachments","Item Type Metadata:Standards","Item Type Metadata:Objectives","Item Type Metadata:Materials","Item Type Metadata:Lesson Plan Text","Item Type Metadata:URL","Item Type Metadata:Event Type","Item Type Metadata:Participants","Item Type Metadata:Birth Date","Item Type Metadata:Birthplace","Item Type Metadata:Death Date","Item Type Metadata:Occupation","Item Type Metadata:Biographical Text","Item Type Metadata:Bibliography",tags,file,itemType,collection,public,featured
"Magazine rack","Boys' and Girls' Branch; Kern County Free Library; Bakersfield","Magazine rack at the Boys' and Girls' Branch, Kern County Free Library, Bakersfield.",Seron,"1 photograph : b&w ; 25.8 x 16.1 cm.","San Joaquin Valley Library System",,"Kern County Library",,"Kern County Library",image/jpeg,en,Image,kel0072,,,,,,,,,,,,,,,,,,,,,,,,,,,,,,,,,,,,"Bakersfield,Children,Kern County Free Library,Libraries",http://digital.sjvls.org/files/original/4e2daea383c6ff970162ddc62f698790.jpg,"Still Image","Kern County Library Collection",1,0
"Group picture, with Doris Stoner","Children; Clothing & dress; Group portraits; Stoner, Doris","Children standing outside building, possibly a school; Doris Stoner (born July 1895, daughter of Austin Foster Stoner) is in front row, exactly in the middle, in dark dress with tie",Unknown,"1 photographic print; 18 x 26 cm.","San Joaquin Valley Library System","circa 1906","Kern County Library","This image is being made available for educational and research purposes only, under the ""fair use"" clause of the U.S. Copyright Law (Title 17 ? 107 U.S.C.) Further questions regarding the image or its use may be directed to the Beale Memorial Library, Local History Room, 701 Truxtun Ave., Bakersfield, CA 93301; phone 661-868-0776.","Kern County Library",image/jpeg,en-US,Image,kec0128,"circa 1906",,,,,,,,,,,,,,,,,,,,,,,,,,,,,,,,,,,"Children,Clothing & dress,Group portraits",http://digital.sjvls.org/files/original/e30990b6bbd25147d7788c353d8a7675.jpg,"Still Image","Kern County Local History Photograph Collection",1,0
"Kern County Library Bookmobile at Red Rock School","Bookmobiles; Children; Red Rock School (Cantil, Calif.); Schools","Children, with adult, beside bookmobile stopping at Red Rock School",Unknown,"1 photographic print; 6 x 8 cm.","San Joaquin Valley Library System",1941,"Kern County Library","This image is being made available for educational and research purposes only, under the ""fair use"" clause of the U.S. Copyright Law (Title 17 ? 107 U.S.C.) Further questions regarding the image or its use may be directed to the Beale Memorial Library, Local History Room, 701 Truxtun Ave., Bakersfield, CA 93301; phone 661-868-0776.","Kern County Library",image/jpeg,en-US,Image,kec0149,1941,,,,,,,,,,,,,,,,,,,,,,,,,,,,,,,,,,,"Bookmobiles,Children,Red Rock School (Cantil, Calif.),Schools",http://digital.sjvls.org/files/original/e7ebb48186b530e43ed3d04207210310.jpg,"Still Image","Kern County Local History Photograph Collection",1,0
"Lola Lightner Fry Busby","Busby, Lola Lightner Fry; Children; Clothing & dress; Portraits","Shows Lola Lightner Fry (born 1893), who later married Floyd Busby; mother of Jack Busby, who was born in 1915.",Unknown,"1 photographic print; 16.5 x 10.5 cm","San Joaquin Valley Library System","circa 1900","Kern County Library","This image is being made available for educational and research purposes only, under the ""fair use"" clause of the U.S. Copyright Law (Title 17 ? 107 U.S.C.) Further questions regarding the image or its use may be directed to the Beale Memorial Library, Local History Room, 701 Truxtun Ave., Bakersfield, CA 93301; phone 661-868-0776.","Kern County Library",image/jpeg,en-US,Image,kec0160,"circa 1900",,,,,,,,,,,,,,,,,,,,,,,,,,,,,,,,,,,"Children,Clothing & dress,Portraits",http://digital.sjvls.org/files/original/7547f17239dc7699cd9ed9311d3aefac.jpg,"Still Image","Kern County Local History Photograph Collection",1,0
"Sixth birthday of Leffler Bequette Miller","Birthday parties; Children; Clothing & dress; Miller, Leffler Bequette","Leffler Bequette Miller, born May 30 1895, with other children celebrating his birthday.House, and horse and wagon, visible in background.",Unknown,"1 phographic print; 21 x 25 cm.","San Joaquin Valley Library System",1901,"Kern County Library","This image is being made available for educational and research purposes only, under the ""fair use"" clause of the U.S. Copyright Law (Title 17 ? 107 U.S.C.) Further questions regarding the image or its use may be directed to the Beale Memorial Library, Local History Room, 701 Truxtun Ave., Bakersfield, CA 93301; phone 661-868-0776.","Kern County Library",image/jpeg,en-US,Image,kec0202,1901,,,,,,,,,,,,,,,,,,,,,,,,,,,,,,,,,,,"Birthday parties,Children,Clothing & dress",http://digital.sjvls.org/files/original/21ffe3ae04604220d674faa47b50b51c.jpg,"Still Image","Kern County Local History Photograph Collection",1,0
"Sixth birthday of Mariella Laidley","Birthday parties; Blodgett, Margaret; Bloom, Evelyn; Chenoweth, Dorothy; Children; Clothing & dress; Colby, Patricia; Deneen, Eileen; Fox, Stook; Helbling, Gene; Jones, Kendall; Laidley, Mariella; Manel, Frederick; McGinn, Barbara; Raine, Arthur; Raine, Kathleen; Rankin, Wanda; Rogers, Frances; Tatum, Jack; Williams, Marian","House on L Street. Front row: Arthur Raine, Barbara McGinn, Frances Rogers, Wanda Rankin, Gene Helbling, Patricia Colby, Mariella Laidley (daughter of Viola Stoner Laidley &amp; William Laidley), Marian Williams. Kneeling, behind front row: Frederick Manel. Second row: Merriwether, Dorothy Chenoweth, unknown, Margaret Blodgett, Stook Fox, Kendall Jones, Evelyn Bloom, unknown, Mr.Gundry, Kathleen Raine, Tom. Back row: Eileen Deneen, Jack Tatum, Frances. Mariella Laidley was the mother of Gaye Lenahan, who donated several family pictures of the Stoner and Laidley families",Unknown,"1 photographic print; 13 x 18 cm.","San Joaquin Valley Library System","circa 1914","Kern County Library","This image is being made available for educational and research purposes only, under the ""fair use"" clause of the U.S. Copyright Law (Title 17 ? 107 U.S.C.) Further questions regarding the image or its use may be directed to the Beale Memorial Library, Local History Room, 701 Truxtun Ave., Bakersfield, CA 93301; phone 661-868-0776.","Kern County Library",image/jpeg,en-US,Image,kec0203,"circa 1914",,,,,,,,,,,,,,,,,,,,,,,,,,,,,,,,,,,"Birthday parties,Children,Clothing & dress",http://digital.sjvls.org/files/original/3a54f1cdcb05ff607c6732b146591e22.jpg,"Still Image","Kern County Local History Photograph Collection",1,0
"Third-grade picture of Viola Stoner and classmates","Children; Clothing & dress; School children; Stoner, Viola","Viola Stoner (daughter of Austin Foster Stoner) is in middle front row, in white dress. Viola Stoner is the grandmother of Gaye Lenahan, who donated several family pictures of the Stoner family.",Unknown,"1 photographic print; 18 x 25 cm.","San Joaquin Valley Library System","circa 1896","Kern County Library","This image is being made available for educational and research purposes only, under the ""fair use"" clause of the U.S. Copyright Law (Title 17 ? 107 U.S.C.) Further questions regarding the image or its use may be directed to the Beale Memorial Library, Local History Room, 701 Truxtun Ave., Bakersfield, CA 93301; phone 661-868-0776.","Kern County Library",image/jpeg,en-US,Image,kec0219,"circa 1896",,,,,,,,,,,,,,,,,,,,,,,,,,,,,,,,,,,"Children,Clothing & dress,School children",http://digital.sjvls.org/files/original/36a495f0959288e71720d467a90b4713.jpg,"Still Image","Kern County Local History Photograph Collection",1,0
"Bruce children, circa 1898","Bruce, William; Bruce, Jeanette; Bruce, Robert; Bruce, Edward; Bruce, Harriet; Wawona, Calif.; Mariposa County (Calif.) -- Photographs; Mariposa County (Calif.) -- Biography; Yosemite National Park (Calif.) -- History; Children -- Clothing & dress -- 1890-1900","Portrait of five Bruce children, standing outdoors, circa 1898; left to right, William, Jeanette, Robert, Edward, Harriet.",,"1 photograph : b&w ; 12.70 x 18.42 cm.","San Joaquin Valley Library System",[1898],"Mariposa County Library","Images can be used for research or educational purposes only. For permission to further reproduce or distribute an image, contact Mariposa County Library. To obtain a photographic or digital copy of the original photograph, contact Mariposa County Library, PO Box 106, Mariposa, CA 95338; phone 209-966-2140.","Bruce Family Collection",image/jpeg,en,Image,http://10.6.12.125/files/original/mpa0027a.jpg,[1898],,,,,,,,,,,,,,,,,,,,,,,,,,,,,,,,,,,"Children,Mariposa County,Wawona, CA",http://digital.sjvls.org/files/original/1a22f5a57a9390a9c30d0c5110bf083a.jpg,"Still Image","Bruce Family Collection",1,0
"Harriet H. Bruce","Bruce, Harriet H.; Spelt, Harriet Bruce; Wawona, Calif.; Mariposa County (Calif.) -- Photographs; Mariposa County (Calif.) -- Biography; Yosemite National Park (Calif.) -- History; Children -- Clothing & dress -- 1890-1900","Oval portrait of Harriet H. Bruce (1884-1969) at about age 10; seated, wearing dark dress.",,"1 photograph : b&w ; 12.70 x 8.90 cm.","San Joaquin Valley Library System",[1894],"Mariposa County Library","Images can be used for research or educational purposes only. For permission to further reproduce or distribute an image, contact Mariposa County Library. To obtain a photographic or digital copy of the original photograph, contact Mariposa County Library, PO Box 106, Mariposa, CA 95338; phone 209-966-2140.","Bruce Family Collection",image/jpeg,en,Image,http://10.6.12.125/files/original/mpa0033a.jpg,[1894],,,,,,,,,,,,,,,,,,,,,,,,,,,,,,,,,,,"Children,Mariposa County,Wawona, CA",http://digital.sjvls.org/files/original/b4c10b6d02372afe470559e55a34501d.jpg,"Still Image","Bruce Family Collection",1,0
"Robert I. Bruce","Bruce, Robert I.; Wawona, Calif.; Mariposa County (Calif.) -- Photographs; Mariposa County (Calif.) -- Biography; Yosemite National Park (Calif.) -- History; Children -- Clothing & dress -- 1890-1900","Portrait of Robert I. Bruce (1895-1924) as a young boy, standing indoors, holding a stringed instrument.",,"1 photograph : b&w ; 20.00 x 15.24 cm.","San Joaquin Valley Library System",[1898],"Mariposa County Library","Images can be used for research or educational purposes only. For permission to further reproduce or distribute an image, contact Mariposa County Library. To obtain a photographic or digital copy of the original photograph, contact Mariposa County Library, PO Box 106, Mariposa, CA 95338; phone 209-966-2140.","Bruce Family Collection",image/jpeg,en,Image,http://10.6.12.125/files/original/mpa0043a.jpg,[1898],,,,,,,Photograph,,,,,,,,,,,,,,,,,,,,,,,,,,,,"Children,Mariposa County,Wawona, CA",http://digital.sjvls.org/files/original/8262d110299ac929e30fe501713bf7cd.jpg,"Still Image","Bruce Family Collection",1,0
