﻿"Dublin Core:Title","Dublin Core:Subject","Dublin Core:Description","Dublin Core:Creator","Dublin Core:Source","Dublin Core:Publisher","Dublin Core:Date","Dublin Core:Contributor","Dublin Core:Rights","Dublin Core:Relation","Dublin Core:Format","Dublin Core:Language","Dublin Core:Type","Dublin Core:Identifier","Dublin Core:Coverage","Item Type Metadata:Text","Item Type Metadata:Interviewer","Item Type Metadata:Interviewee","Item Type Metadata:Location","Item Type Metadata:Transcription","Item Type Metadata:Local URL","Item Type Metadata:Original Format","Item Type Metadata:Physical Dimensions","Item Type Metadata:Duration","Item Type Metadata:Compression","Item Type Metadata:Producer","Item Type Metadata:Director","Item Type Metadata:Bit Rate/Frequency","Item Type Metadata:Time Summary","Item Type Metadata:Email Body","Item Type Metadata:Subject Line","Item Type Metadata:From","Item Type Metadata:To","Item Type Metadata:CC","Item Type Metadata:BCC","Item Type Metadata:Number of Attachments","Item Type Metadata:Standards","Item Type Metadata:Objectives","Item Type Metadata:Materials","Item Type Metadata:Lesson Plan Text","Item Type Metadata:URL","Item Type Metadata:Event Type","Item Type Metadata:Participants","Item Type Metadata:Birth Date","Item Type Metadata:Birthplace","Item Type Metadata:Death Date","Item Type Metadata:Occupation","Item Type Metadata:Biographical Text","Item Type Metadata:Bibliography",tags,file,itemType,collection,public,featured
"Allensworth School, Allensworth, Tulare County, Calif.","African-Americans -- California -- Tulare County.; Schools -- California -- Tulare County; Allensworth (Calif.) -- Buildings, structures, etc.; Allensworth (Calif.) -- Schools.; Tulare County (Calif.) -- Schools -- History.","This is the Allensworth School in Allensworth, located in southern Tulare County, CA.",,"1 photograph : b&w ; 11 x 8 cm.","San Joaquin Valley Library System",,"Tulare County Library","This image is being made available for educational and research purposes only, under the ?fair use? clause of the U.S. Copyright Law (Title 17 ? 107 U.S.C.) Further questions regarding the image or its use may be directed to the Tulare County Library, 200 W. Oak Ave., Visalia, CA 93291; Phn: 559-733-6954; Fax: 559-737-4586.","Tulare County Library -- Photo Files",image/jpeg,en,Image,tca0021,,,,,,,,,,,,,,,,,,,,,,,,,,,,,,,,,,,,"African-Americans,Allensworth,Schools,Schools -- California -- Tulare County,structures,Tulare County (Calif.) -- Schools -- History.",http://digital.sjvls.org/files/original/29344d273dfc335faa8d49c40fdd4070.jpg,"Still Image","Annie Mitchell History Room Photo Files",1,0
"Jim and Cooley Niles","Niles Cooley; Niles, Jim; Mill Street School; 4th Street; Porterville, California","Jim and Cooley Niles in their buggy on 4th Street between Mill Street and Oak Street.  Mill Street School is in the background.","R. W. Riggs","1 photograph : b&w ; 17.39 x 11.4 cm.","San Joaquin Valley Library System",1890,"Porterville Public Library","The images presented in these online galleries were selected from the photograph collection of the Local History Room in the Porterville Public Library. For more information about acquiring copies of these images please contact Carolyn Johnson, Porterville Public Library, 41 W. Thurman Ave., Porterville, California 93257; (559) 784-0177.","Porterville Public Library",image/jpeg,en,Image,pva0214,1890,,,,,,,,,,,,,,,,,,,,,,,,,,,,,,,,,,,"CA,Mill Street School,Porterville,Porterville, CA,Schools",http://digital.sjvls.org/files/original/589d8f1fe1867922fbaff15259973c1a.jpg,"Still Image","Porterville Public Library",1,0
"1896 White River School Class","Allen, Annie .; Allen,Bennie; Barbero, Harry; Becker, Susie; Benton, Miss Dorothy; Doty,Maude; Guthrie, ___; Guthrie, ___; Harris, Helen Agnes; Harris, Madge Evelyn; Kline, Myrtle; Uhl, Bertha; Uhl, Cliff; Uhl, Cynthia; Uhl, Gertie; Uhl, Laura; Van Duesen, Oscar; Van Duesen, Walter; Villard,  ___; Villard, ___; White River School; White River, California","1896 White River School Class Picture taken in White River, California.Back row left to right:Oscar Van Duesen, Miss Dorothy Benton (teacher), Harry Barbaro,__ Guthrie, ___Guthrie, Bennie Allen,__ Villard, Cynthia Uhl.Middle row left to right: Cliff Uhl, Walter Van Duesen, Gertie Uhl, Susie Becker, Laura Uhl, Madge Evelyn Harris, Helen Agnes Harris, Bertha Uhl.  Front row left to right: __Villard, Maude Doty, Myrtle Kline, Annie Allen.",,"1 photograph : b&w ; 16.17 x 11.07 cm.","San Joaquin Valley Library System",1896,"Porterville Public Library","The images presented in these online galleries were selected from the photograph collection of the Local History Room in the Porterville Public Library. For more information about acquiring copies of these images please contact Carolyn Johnson, Porterville Public Library, 41 W. Thurman Ave., Porterville, California 93257; (559) 784-0177.","Porterville Public Library",image/jpeg,en,Image,pva0154,1896,,,,,,,,,,,,,,,,,,,,,,,,,,,,,,,,,,,"Schools,Students,White River,White River, California",http://digital.sjvls.org/files/original/8b0a7ad3c96eb2e32372d6057234237a.jpg,"Still Image","Porterville Public Library",1,0
"El Granito High School","El Granito High School; Belleview Street; E Street; Morton Street; Porterville, Ca.","El Granito High School in Porterville California.",,"1 photograph : b&w ; 13.69 x 8.76 cm.","San Joaquin Valley Library System",[1910],"Porterville Public Library","The images presented in these online galleries were selected from the photograph collection of the Local History Room in the Porterville Public Library. For more information about acquiring copies of these images please contact Carolyn Johnson, Porterville Public Library, 41 W. Thurman Ave., Porterville, California 93257; (559) 784-0177.","Porterville Public Library",image/jpeg,en,Image,pva0020,[1910],,,,,,,,,,,,,,,,,,,,,,,,,,,,,,,,,,,"Porterville,Porterville, Ca.,Schools",http://digital.sjvls.org/files/original/baa612aa7087bb4363b40b511476cb97.jpg,"Still Image","Porterville Public Library",1,0
"Patterson School in Berenda","Berenda, CA","Patterson School in Berenda",,"1 photograph : b & w ; 5.08 x 10.16 cm.","San Joaquin Valley Library System",,"Madera County Library","Jay Chapel Funeral Directors control the rights to the reproduction and distribution of this digital image.  The image can be used for research or educational purposes only. To obtain a copy of the original photograph, Contact Jay Chapel Funeral Directors, 1121 Roberts Ave. Madera, CA 93637  Phone: (559) 674-8814  jaychapel@jaychapel.com","Jay Chapel Funeral Directors",image/jpeg,en,Image,maj0011,,,,,,,,,,,,,,,,,,,,,,,,,,,,,,,,,,,,"Berenda,CA,Schools",http://digital.sjvls.org/files/original/d9d15f7525212cf30fbdd73ea5f1c75e.jpg,"Still Image","Jay Chapel Funeral Directors",1,0
"First Adventist School in Bethel","Bethel, Madera County CA","First Adventist School in Bethel",,"1 photograph : b & w ; 10.16 x 15.24 cm.","San Joaquin Valley Library System",,"Madera County Library","Jay Chapel Funeral Directors control the rights to the reproduction and distribution of this digital image.  The image can be used for research or educational purposes only. To obtain a copy of the original photograph, Contact Jay Chapel Funeral Directors, 1121 Roberts Ave. Madera, CA 93637  Phone: (559) 674-8814  jaychapel@jaychapel.com","Jay Chapel Funeral Directors",image/jpeg,en,Image,maj0009,,,,,,,,,,,,,,,,,,,,,,,,,,,,,,,,,,,,"Bethel,Madera County CA,Schools",http://digital.sjvls.org/files/original/dd382037a355b8d374b11d92e520eb57.jpg,"Still Image","Jay Chapel Funeral Directors",1,0
"Mechanicsville Elementary School Auberry California","Mechanicsville Elementary School (Auberry, Calif.) -- Photographs.; Historic buildings -- California -- Fresno County -- 20th century -- Photographs.; School buildings -- California -- Fresno County -- 20th century -- Photographs.; Schools -- California -- Fresno County -- 20th century -- Photographs.; Auberry (Calif.) -- Buildings, structures, etc. -- Photographs.","Picture of Mechanicsville Elementary School, built in 1916 by Bill Samson and Son at the intersection of Tollhouse and Pittman Hill roads near Auberry, Calif. Shows Shotgun architectural style. This was the second schoolhouse building to service the Mechanicsville District, which was created in 1875. The school was closed in 1926, and the area was later served by the Sierra Unified School District.",,"1 Photographic print :b&w ;6 x 8 cm.","San Joaquin Valley Library System","ca 1925","Fresno County Public Library","This image is being made available for educational and research purposes only, under the “fair use” clause of the U.S. Copyright Law (Title 17 § 107 U.S.C.) Further questions regarding the image or its use may be directed to the Fresno County Public Library, Heritage Center, 2420 Mariposa St, Fresno, CA 93721. Phone: 559-600-6230 HeritageCenter@fresnolibrary.org","Fresno County Public Library. California History and Genealogy Room.",image/jpeg,en,Image,frs0046,"ca 1925",,,,,,,,,,,,,,,,,,,,,,,,,,,,,,,,,,,"Auberry,Historic buildings -- California -- Fresno County -- 20th century -- Photographs.,Mechanicsville Elementary School (Auberry,Mechanicsville Elementary School (Auberry, Calif.) -- Photographs.,School buildings -- California -- Fresno County -- 20th century -- Photographs.,Schools,Schools -- California -- Fresno County -- 20th century -- Photographs.,structures",http://digital.sjvls.org/files/original/3f49b7d4b56f5be833a7630c157d22e7.jpg,"Still Image","Fresno County Public Library School Photographs",1,0
"Lerona Elementary School Auberry California","Lerona Elementary School (Auberry, Calif.) -- Photographs.; Historic buildings -- California -- Fresno County -- 20th century -- Photographs.; School buildings -- California -- Fresno County -- 20th century -- Photographs.; Schools -- California -- Fresno County -- 20th century -- Photographs.; Auberry (Calif.) -- Buildings, structures, etc. -- Photographs.","Picture of Lerona Elementary School, located 10 miles east of Auberry, Calif., on San Joaquin and Eastern Railroad siding. The Lerona District was created in 1923 and was later annexed by the Big Sandy District, which later incorporated into the Sierra Unified School District in 1939.",,"1 Photographic print :b&w ;6 x 8 cm.","San Joaquin Valley Library System","ca 1925","Fresno County Public Library","This image is being made available for educational and research purposes only, under the “fair use” clause of the U.S. Copyright Law (Title 17 § 107 U.S.C.) Further questions regarding the image or its use may be directed to the Fresno County Public Library, Heritage Center, 2420 Mariposa St, Fresno, CA 93721. Phone: 559-600-6230 HeritageCenter@fresnolibrary.org","Fresno County Public Library. California History and Genealogy Room.",image/jpeg,en,Image,frs0041,"ca 1925",,,,,,,,,,,,,,,,,,,,,,,,,,,,,,,,,,,"Auberry,Historic buildings -- California -- Fresno County -- 20th century -- Photographs.,Lerona Elementary School (Auberry,Lerona Elementary School (Auberry, Calif.) -- Photographs.,School buildings -- California -- Fresno County -- 20th century -- Photographs.,Schools,Schools -- California -- Fresno County -- 20th century -- Photographs.,structures",http://digital.sjvls.org/files/original/be22089e380e75e2a2a13c14f578789e.jpg,"Still Image","Fresno County Public Library School Photographs",1,0
"Fruitvale Elementary School Selma California","Fruitvale Elementary School (Selma, Calif.) -- Photographs.; Historic buildings -- California -- Fresno County -- 20th century -- Photographs.; School buildings -- California -- Fresno County -- 20th century -- Photographs.; Schools -- California -- Fresno County -- 20th century -- Photographs.; Selma (Calif.) -- Buildings, structures, etc. -- Photographs.","Picture of Fruitvale Elementary School, built ca. 1900, 1/2 mile south of the intersection of Bethel and Manning avenues, Selma, Calif. Shows Western Stick architectural style but final disposition of structure unknown. The Fruitvale District was created in 1885, united with the Selma Union High (later, Selma Unified) School District in 1892, and merged with the Walnut District to form the Indianola District in 1950. This district, in turn, became part of the Selma Union High (later, Selma Unified) School District in 1967.",,"1 Photographic print :b&w ;6 x 8 cm.","San Joaquin Valley Library System","ca 1925","Fresno County Public Library","This image is being made available for educational and research purposes only, under the “fair use” clause of the U.S. Copyright Law (Title 17 § 107 U.S.C.) Further questions regarding the image or its use may be directed to the Fresno County Public Library, Heritage Center, 2420 Mariposa St, Fresno, CA 93721. Phone: 559-600-6230 HeritageCenter@fresnolibrary.org","Fresno County Public Library. California History and Genealogy Room.",image/jpeg,en,Image,frs0027,"ca 1925",,,,,,,,,,,,,,,,,,,,,,,,,,,,,,,,,,,"Fruitvale Elementary School (Selma,Fruitvale Elementary School (Selma, Calif.) -- Photographs.,Historic buildings -- California -- Fresno County -- 20th century -- Photographs.,School buildings -- California -- Fresno County -- 20th century -- Photographs.,Schools,Schools -- California -- Fresno County -- 20th century -- Photographs.,Selma,Selma (Calif.) -- Buildings,Selma (Calif.) -- Buildings, structures, etc. -- Photographs.,structures",http://digital.sjvls.org/files/original/36e3cc2cf3e0d4d812c7759c82a2b100.jpg,"Still Image","Fresno County Public Library School Photographs",1,0
"Bullard Elementary School Fresno California","Bullard Elementary School (Fresno, Calif.) -- Photographs.; Historic buildings -- California -- Fresno County -- 20th century -- Photographs.; School buildings -- California -- Fresno County -- 20th century -- Photographs.; Schools -- California -- Fresno County -- 20th century -- Photographs.; Fresno (Calif.) -- Buildings, structures, etc. -- Photographs.","Picture of Bullard Elementary School, located near the corner of Palm and Shaw avenues, Fresno, Calif. The school was constructed ca. 1915, and ceased operation in 1951. The Bullard District was renamed the Bullard Unified District in 1952, and merged with the Fresno Unified School District in 1958.",,"1 Photographic print :b&w ;6 x 8 cm.","San Joaquin Valley Library System","ca 1925","Fresno County Public Library","This image is being made available for educational and research purposes only, under the “fair use” clause of the U.S. Copyright Law (Title 17 § 107 U.S.C.) Further questions regarding the image or its use may be directed to the Fresno County Public Library, Heritage Center, 2420 Mariposa St, Fresno, CA 93721. Phone: 559-600-6230 HeritageCenter@fresnolibrary.org","Fresno County Public Library. California History and Genealogy Room.",image/jpeg,en,Image,frs0008,"ca 1925",,,,,,,,,,,,,,,,,,,,,,,,,,,,,,,,,,,"Bullard Elementary School (Fresno,Fresno,Fresno (Calif.) -- Buildings,Fresno (Calif.) -- Buildings, structures, etc. -- Photographs.,Historic buildings -- California -- Fresno County -- 20th century -- Photographs.,School buildings -- California -- Fresno County -- 20th century -- Photographs.,Schools,Schools -- California -- Fresno County -- 20th century -- Photographs.,structures",http://digital.sjvls.org/files/original/29f8b4b69c489ba8bc057cf5300cba6f.jpg,"Still Image","Fresno County Public Library School Photographs",1,0
