﻿"Dublin Core:Title","Dublin Core:Subject","Dublin Core:Description","Dublin Core:Creator","Dublin Core:Source","Dublin Core:Publisher","Dublin Core:Date","Dublin Core:Contributor","Dublin Core:Rights","Dublin Core:Relation","Dublin Core:Format","Dublin Core:Language","Dublin Core:Type","Dublin Core:Identifier","Dublin Core:Coverage","Item Type Metadata:Text","Item Type Metadata:Interviewer","Item Type Metadata:Interviewee","Item Type Metadata:Location","Item Type Metadata:Transcription","Item Type Metadata:Local URL","Item Type Metadata:Original Format","Item Type Metadata:Physical Dimensions","Item Type Metadata:Duration","Item Type Metadata:Compression","Item Type Metadata:Producer","Item Type Metadata:Director","Item Type Metadata:Bit Rate/Frequency","Item Type Metadata:Time Summary","Item Type Metadata:Email Body","Item Type Metadata:Subject Line","Item Type Metadata:From","Item Type Metadata:To","Item Type Metadata:CC","Item Type Metadata:BCC","Item Type Metadata:Number of Attachments","Item Type Metadata:Standards","Item Type Metadata:Objectives","Item Type Metadata:Materials","Item Type Metadata:Lesson Plan Text","Item Type Metadata:URL","Item Type Metadata:Event Type","Item Type Metadata:Participants","Item Type Metadata:Birth Date","Item Type Metadata:Birthplace","Item Type Metadata:Death Date","Item Type Metadata:Occupation","Item Type Metadata:Biographical Text","Item Type Metadata:Bibliography",tags,file,itemType,collection,public,featured
"Flood in Visalia, California","Floods -- California -- Visalia.","Main Street, Visalia, California, was inundated for a second time in two months in February 1956. Here workers try to clear and obstruction in Mill Creek.",,,"San Joaquin Valley Library System",1956,"Tulare County Library","This image is being made available for educational and research purposes only, under the ?fair use? clause of the U.S. Copyright Law (Title 17 ? 107 U.S.C.) Further questions regarding the image or its use may be directed to the Tulare County Library, 200 W. Oak Ave., Visalia, CA 93291; Phn: 559-733-6954; Fax: 559-737-4586.","Shades of Tulare County (Tulare County Library)",image/jpeg,en,Image,tcb0478,1956,,,,,,,,,,,,,,,,,,,,,,,,,,,,,,,,,,,"Floods,Visalia",http://digital.sjvls.org/files/original/07f7b315df1fa0034599c95f4410fa89.jpg,"Still Image","Shades of Tulare County Project",1,0
"Chan family barbecue in Visalia,California","Chan family.","Chan family backyard barbecue.",,,"San Joaquin Valley Library System",,"Tulare County Library","This image is being made available for educational and research purposes only, under the ?fair use? clause of the U.S. Copyright Law (Title 17 ? 107 U.S.C.) Further questions regarding the image or its use may be directed to the Tulare County Library, 200 W. Oak Ave., Visalia, CA 93291; Phn: 559-733-6954; Fax: 559-737-4586.","Shades of Tulare County (Tulare County Library)",image/jpeg,en,Image,tcb0476,,,,,,,,,,,,,,,,,,,,,,,,,,,,,,,,,,,,"Chan family.,Visalia",http://digital.sjvls.org/files/original/65dfed308f95b263746e2888a0770219.jpg,"Still Image","Shades of Tulare County Project",1,0
"Otani's Store, Visalia, California","Otani, Harry.; Otani, Haruku.; Otani, Ura.; Otani's Store (Visalia, Calif.)","Otani's Store was located on East Center Street in Visalia, California. This photo, taken in the 1930s, shows the interior of the store which sold groceries and general merchandise. Pictured are (left to right) Ura Otani (mother of donor Hideo Otani), Haruku Otani (cousin) and Harry Otani (brother).",,,"San Joaquin Valley Library System",1930s,"Tulare County Library","This image is being made available for educational and research purposes only, under the ?fair use? clause of the U.S. Copyright Law (Title 17 ? 107 U.S.C.) Further questions regarding the image or its use may be directed to the Tulare County Library, 200 W. Oak Ave., Visalia, CA 93291; Phn: 559-733-6954; Fax: 559-737-4586.","Shades of Tulare County (Tulare County Library)",image/jpeg,en,Image,tcb0472,1930s,,,,,,,,,,,,,,,,,,,,,,,,,,,,,,,,,,,"Otani's Store (Visalia, Calif.),Stores,Visalia",http://digital.sjvls.org/files/original/6bee8c1a8995b2cf83bb892e4f6651c2.jpg,"Still Image","Shades of Tulare County Project",1,0
"Visalia Union High School football team","Black, Tom.; Bodine, George.; Bucher, Ted.; Chaffee, Lawrence.; Davis, Bill.; Davis, Orly.; Ellis, Dutch.; Garcia, George.; Hausan, Lawrence.; Herren, Houston ""Hoot.""; Kilbreth, Clifford.; Miller, Gerald.; Righter, Major George L.; Robertson, Comer.; Sakamota, Tommy.; Shippey, Chester.; Stevens, John.; Stevens, Mose.; Vielmas, Alexander ""Pooch.""; Weinert, Chuck.; Willhide, Roy.; Football teams -- California -- Visalia.","The 1922 Visalia Union High School football team posed for the school yearbook photo in Visalia, California. Pictured are (left to right) top row: Lawrence Hausan, George Kassapian, George Bodine, Roy Willhide, Major George L. Righter (coach), Mose Stevens, Gerald Miller, Tommy Sakamota and Tom Black. Middle row: Harley_____, Chuck Weinert, Chester Shippey, Comer Robertson, Dutch Ellis, Bill Davis and George Garcia. Bottom row: Ted Bucher, Alexander ""Pooch"" Vielmas, Houston ""Hoot"" Herren, Lawrence Chaffee, John Stevens, Clifford Kilbreth and Orly Davis.",,,"San Joaquin Valley Library System",1921,"Tulare County Library","This image is being made available for educational and research purposes only, under the ?fair use? clause of the U.S. Copyright Law (Title 17 ? 107 U.S.C.) Further questions regarding the image or its use may be directed to the Tulare County Library, 200 W. Oak Ave., Visalia, CA 93291; Phn: 559-733-6954; Fax: 559-737-4586.","Shades of Tulare County (Tulare County Library)",image/jpeg,en,Image,tcb0471,1921,,,,,,,,,,,,,,,,,,,,,,,,,,,,,,,,,,,"Athletes,Comer.,Ellis,Football,Garcia,Miller,Stevens,Teams,Visalia,Visalia Union High School",http://digital.sjvls.org/files/original/a2f3970ceb3374d3c2cd3432e3ab0061.jpg,"Still Image","Shades of Tulare County Project",1,0
"Mike Suyeda and Yoshikazu Morioka at Mooney Grove","Morioka, Yoshikazu.; Suyeda, Mike.; Mooney Grove Park (Visalia, Calif.)","Mike Suyeda slides down the slide as his grandfather, Yoshikazu Morioka, watches. The photo was taken at Mooney Grove Park, Visalia, California, in 1948.",,,"San Joaquin Valley Library System",1948,"Tulare County Library","This image is being made available for educational and research purposes only, under the ?fair use? clause of the U.S. Copyright Law (Title 17 ? 107 U.S.C.) Further questions regarding the image or its use may be directed to the Tulare County Library, 200 W. Oak Ave., Visalia, CA 93291; Phn: 559-733-6954; Fax: 559-737-4586.","Shades of Tulare County (Tulare County Library)",image/jpeg,en,Image,tcb0462,1948,,,,,,,,,,,,,,,,,,,,,,,,,,,,,,,,,,,"Mooney Grove,Mooney Grove Park (Visalia, Calif.),Morioka,Visalia",http://digital.sjvls.org/files/original/c2a4700794d4566589a2823dd864a544.jpg,"Still Image","Shades of Tulare County Project",1,0
"James Nitta and Hiroshi Eki in downtown Visalia, California","Eki, Hiroshi.; Nitta, James.; Visalia (Calif.)","James Nitta (right) and Hiroshi Eki on Main Street in Visalia, California, in the 1930s.",,,"San Joaquin Valley Library System",1930s,"Tulare County Library","This image is being made available for educational and research purposes only, under the ?fair use? clause of the U.S. Copyright Law (Title 17 ? 107 U.S.C.) Further questions regarding the image or its use may be directed to the Tulare County Library, 200 W. Oak Ave., Visalia, CA 93291; Phn: 559-733-6954; Fax: 559-737-4586.","Shades of Tulare County (Tulare County Library)",image/jpeg,en,Image,tcb0458,1930s,,,,,,,,,,,,,,,,,,,,,,,,,,,,,,,,,,,"Hiroshi.,Visalia,Visalia (Calif.)",http://digital.sjvls.org/files/original/f1b9c805129818fd7620effe6136796f.jpg,"Still Image","Shades of Tulare County Project",1,0
"Tom's and Luck Auto Supply on Visalia's Main Street in 1955-56 flood","Bank of America, Visalia (Calif.); Hotel Johnson, Visalia (Calif.); Lucky Auto Store, Visalia (Calif.); Toms Furniture, Visalia (Calif.); Floods -- California -- Visalia.; Main Street (Visalia, Calif.); Visalia -- Buildings, structures, etc.","Main Street, Visalia, California, in the flood of 1955-56. Pictured are Tom's furniture store, and the Lucky Auto Supply Store, on the corner of Main and Garden Streets. In the background are the Grand Theater and (on the corner of Main and Church Streets, the Hotel Johnson. On the other side of the intersection (far left) is the Bank of America building.",,,"San Joaquin Valley Library System",1955-56,"Tulare County Library","This image is being made available for educational and research purposes only, under the ?fair use? clause of the U.S. Copyright Law (Title 17 ? 107 U.S.C.) Further questions regarding the image or its use may be directed to the Tulare County Library, 200 W. Oak Ave., Visalia, CA 93291; Phn: 559-733-6954; Fax: 559-737-4586.","Shades of Tulare County (Tulare County Library)",image/jpeg,en,Image,tcb0438,1955-56,,,,,,,,,,,,,,,,,,,,,,,,,,,,,,,,,,,"Banks,Buildings,Floods,Floods -- California -- Visalia.,Hotel Johnson,Hotel Johnson, Visalia (Calif.),Hotels,Lucky Auto Store,Lucky Auto Store, Visalia (Calif.),Main Street (Visalia,Main Street (Visalia, Calif.),Stores,Streets,structures,Toms Furniture,Toms Furniture, Visalia (Calif.),Visalia,Visalia -- Buildings,Visalia -- Buildings, structures, etc.,Visalia (Calif.)",http://digital.sjvls.org/files/original/85094994de597e688c3eed726cf18608.jpg,"Still Image","Shades of Tulare County Project",1,0
"Gong's Meat Market in Visalia, California, in the 1955-56 flood","Gong's Meat Market (Visalia, Calif.); Floods -- California -- Visalia.","View of 1955-56 floods in downtown Visalia, California, shows Main Street under water. The photo was taken from near Garden Street, looking toward the west. Gong's Meat Market can be seen (left center) near the corner of Main and Chirch Streets.",,,"San Joaquin Valley Library System",1955-56,"Tulare County Library","This image is being made available for educational and research purposes only, under the ?fair use? clause of the U.S. Copyright Law (Title 17 ? 107 U.S.C.) Further questions regarding the image or its use may be directed to the Tulare County Library, 200 W. Oak Ave., Visalia, CA 93291; Phn: 559-733-6954; Fax: 559-737-4586.","Shades of Tulare County (Tulare County Library)",image/jpeg,en,Image,tcb0436,1955-56,,,,,,,,,,,,,,,,,,,,,,,,,,,,,,,,,,,"Floods,Floods -- California -- Visalia.,Gong's Meat Market,Gong's Meat Market (Visalia,Gong's Meat Market (Visalia, Calif.),Visalia",http://digital.sjvls.org/files/original/c549f39cad8ef2ef9f8c39ef313ea588.jpg,"Still Image","Shades of Tulare County Project",1,0
"Visalia Buddhist Church YBA basketball team","Hasebe, Michael.; Hasebe, Randall.; Basketball teams -- California -- Visalia.","Michael Hasebe (on the left) is pictured with the 1976 Visalia Buddhist Church YBA basketball team. His eldest son, Randall, is pictured in the front row, left.",,,"San Joaquin Valley Library System",1976,"Tulare County Library","This image is being made available for educational and research purposes only, under the ?fair use? clause of the U.S. Copyright Law (Title 17 ? 107 U.S.C.) Further questions regarding the image or its use may be directed to the Tulare County Library, 200 W. Oak Ave., Visalia, CA 93291; Phn: 559-733-6954; Fax: 559-737-4586.","Shades of Tulare County (Tulare County Library)",image/jpeg,en,Image,tcb0404,1976,,,,,,,,,,,,,,,,,,,,,,,,,,,,,,,,,,,"Basketball,Visalia",http://digital.sjvls.org/files/original/844a6d2de46f14e7e02221da0d0ffbae.jpg,"Still Image","Shades of Tulare County Project",1,0
"Candy store owned by Totaro Fujimura in Visalia, California.","Fujimura, Totaro.; Stores, Retail -- California -- Visalia.","Totaro Fujimura owned this candy store on N. East St. (now N. Santa Fe. St.) in Visalia, California. This 1924 photo shows the interior of the store and three young children.",,,"San Joaquin Valley Library System",1924,"Tulare County Library","This image is being made available for educational and research purposes only, under the ?fair use? clause of the U.S. Copyright Law (Title 17 ? 107 U.S.C.) Further questions regarding the image or its use may be directed to the Tulare County Library, 200 W. Oak Ave., Visalia, CA 93291; Phn: 559-733-6954; Fax: 559-737-4586.","Shades of Tulare County (Tulare County Library)",image/jpeg,en,Image,tcb0353,1924,,,,,,,,,,,,,,,,,,,,,,,,,,,,,,,,,,,"Candy stores,Fujimura,Retail -- California -- Visalia.,Stores,Stores, Retail -- California -- Visalia.,Visalia",http://digital.sjvls.org/files/original/92adecadcfc7e5fb15c63fc5fc570d38.jpg,"Still Image","Shades of Tulare County Project",1,0
